The Muninn Organization Ontology
type: Ontology
description: The Muninn Organization Ontology is meant to deal with organizations, people and the relationships that bind them all.
version info: 0.3

Era (Historical)
type: Class
name: Era
label: Époque historique @fr
label: Periodisierung @de
comment: An loosely defined historical era to which objects can belong.
subclass of: ProperInterval

Contains
type: ObjectProperty
name: Contains
label: Contient @fr
label: enthält @de
comment: Indicates that the Era contains the Class, Property or Instances belongs to this perticular Era.
domain: Era
inverse of: In Era

In Era
type: ObjectProperty
name: inEra
label: Contenue par L'Ere @fr
label: enthält Periodisierung @de
comment: Indicates that the Class, Property or Instances belongs to this perticular Era.
range: Era

Ancien Régime in France
type: Era
label: Старый порядок @ru
label: Ancien régime @sv
label: Ancien Régime @nl
label: Antigo Regime @pt
label: Antiguo Régimen @es
comment: The Ancien Régime (Old Regime) refers primarily to the aristocratic, social and political system established in France from (roughly) the 15th century to the 18th century under the late Valois and Bourbon dynasties. (Wikipedia)

British Empire
type: Era
label: Império Britânico @pt
label: Imperium brytyjskie @pl
label: Britse Rijk @nl
label: 大英帝国 @zh
label: Brittiläinen imperiumi @fi
label: Britisches Weltreich @de
label: Imperio británico @es
label: Det britiske imperiet @no
label: Британская империя @ru
label: イギリス帝国 @ja
label: Brittiska imperiet @sv
label: Impero britannico @it
label: Empire britannique @fr
comment: The British Empire comprised the dominions, colonies, protectorates, mandates, and other territories ruled or administered by the United Kingdom. It originated with the overseas colonies and trading posts established by England in the late 16th and early 17th centuries. At its height it was the largest empire in history and, for over a century, was the foremost global power.

British Raj
type: Era
label: Britisk India @no
label: Raj britannique @fr
label: Raj británico @es
label: Brits-Indië @nl
label: Brittiska Indien @sv
label: 英属印度 @zh
label: イギリス領インド帝国 @ja
label: Britisch-Indien @de
label: Raj Britannico @it
label: Indie Brytyjskie @pl
label: Índia britânica @pt
label: Brittiläinen Intia @fi
label: Британская Индия @ru
comment: The British Raj is the name given to the period of British colonial rule in South Asia between 1858 and 1947; it can also refer to the dominion itself and even the region under the rule. The region, commonly called India in contemporary usage, included areas directly administered by Britain, as well as the princely states ruled by individual rulers under the paramountcy of the British Crown.

Bronze Age
type: Era
label: 青铜时代 @zh
label: Bronzezeit @de
label: 青銅器時代 @ja
label: Edad del Bronce @es
label: Pronssikausi @fi
label: Âge du bronze @fr
label: Idade do Bronze @pt
label: Epoka brązu @pl
label: Età del bronzo @it
label: Bronstijd @nl
label: Bronsealderen @no
label: Бронзовый век @ru
label: Bronsåldern @sv
comment: The Bronze Age is a period characterized by the use of copper and its alloy bronze as the chief hard materials in the manufacture of some implements and weapons. Chronologically, it stands between the Stone Age and Iron Age. The term Stone Age implies the inability to smelt any ore, the term Bronze Age implies the inability to smelt iron ore and the term Iron Age implies the ability to manufacture artifacts in any of the three types of hard material.

Industrial Revolution
type: Era
label: Teollinen vallankumous @fi
label: 工业革命 @zh
label: Révolution industrielle @fr
label: 産業革命 @ja
label: Industriële revolutie @nl
label: Промышленная революция @ru
label: Revolução Industrial @pt
label: Industriella revolutionen @sv
label: Industrielle Revolution @de
label: Revolución Industrial @es
label: Rewolucja przemysłowa @pl
label: Rivoluzione industriale @it
label: Den industrielle revolusjon @no
comment: The Industrial Revolution was a period from the 18th to the 19th century where major changes in agriculture, manufacturing, mining, transportation, and technology had a profound effect on the socioeconomic and cultural conditions of the times. It began in the United Kingdom, then subsequently spread throughout Europe, North America, and eventually the world. The Industrial Revolution marks a major turning point in human history; almost every aspect of daily life was influenced in some way.

Iron Age
type: Era
label: Edad del Hierro @es
label: 铁器时代 @zh
label: IJzertijd @nl
label: Järnåldern @sv
label: Jernalderen @no
label: Rautakausi @fi
label: Idade do Ferro @pt
label: Età del ferro @it
label: Âge du fer @fr
label: 鉄器時代 @ja
label: Epoka żelaza @pl
label: Железный век @ru
label: Eisenzeit @de
comment: The Iron Age is the archaeological period generally occurring after the Bronze Age, marked by the prevalent use of iron. The early period of the age is characterized by the widespread use of iron or steel. The adoption of such material coincided with other changes in society, including differing agricultural practices, religious beliefs and artistic styles.

Middle Ages
type: Era
label: Keskiaika @fi
label: Middeleeuwen @nl
label: Średniowiecze @pl
label: 中世纪 @zh
label: Medeltiden @sv
label: Edad Media @es
label: 中世 @ja
label: Mittelalter @de
label: Medioevo @it
label: Средние века @ru
label: Middelalderen @no
label: Moyen Âge @fr
label: Idade Média @pt
comment: The Middle Ages was a period of European history from the 5th to the 15th century. The period followed the fall of the Western Roman Empire in 476, and preceded the Early Modern Era. It is the middle period in a three-period division of history: Classic, Medieval, and Modern. The term "Middle Ages" first appears in Latin in the 15th century and reflects the view that this period was a deviation from the path of classical learning, a path supposedly reconnected by Renaissance scholarship.

Modern history
type: Era
label: Uusi aika @fi
label: Époque moderne @fr
label: 近代 @ja
label: Premodernism @sv
label: Modern historia @sv
label: 現代史 @zh
label: Nieuwe Tijd @nl
label: Neuzeit @de
comment: Modern history, or the modern era, describes the historical timeline after the Middle Ages. Modern history can be further broken down into the early modern period and the late modern period after the French Revolution and the Industrial Revolution. Contemporary history describes the span of historic events that are immediately relevant to the present time. The modern era began approximately in the 16th century.

Napoleonic era
type: Era
label: Napoleontische tijd @nl
label: Napoleonstiden @no
label: Età napoleonica @it
comment: The Napoleonic Era is a period in the history of France and Europe. It is generally classified as including the fourth and final stage of the French Revolution, the first being the National Assembly, the second being the Legislative Assembly, and the third being the Directory.

Victorian era
type: Era
label: Викторианская эпоха @ru
label: Viktoriaaninen aikakausi @fi
label: Viktoriansk tid @sv
label: Époque victorienne @fr
label: Epoka wiktoriańska @pl
label: Era vitoriana @pt
label: Inghilterra vittoriana @it
label: ヴィクトリア朝 @ja
label: 维多利亚时代 @zh
label: Época victoriana @es
label: Victoriaans tijdperk @nl
label: Viktorianisches Zeitalter @de
comment: The Victorian era of the United Kingdom was the period of Queen Victoria's reign from 20 June 1837 until her death on 22 January 1901. It was a long period of prosperity for the British people. Some scholars extend the beginning of the period—as defined by a variety of sensibilities and political concerns that have come to be associated with the Victorians—back five years to the passage of the Reform Act 1832. The era was preceded by the Georgian period and succeeded by the Edwardian period.

First World War Era
type: Era
name: Great War
label: Ére de la Premiére Guerre Mondiale @fr
label: Erster Weltkrieg Periodisierung @de
comment: The First World War Era encompasses all the objects of the war, including events or objects that led to the war and immediate aftermath, such as demobilization.

Second World War Era
type: Era
name: Second World War
label: Ére de la Deuxiéme Guerre Mondiale @fr
label: Zweite Weltkrieg Periodisierung @de
comment: The Second World War Era encompasses all the objects of the war, including events or objects that led to the war and immediate aftermath, such as demobilization.

Inter War Era
type: Era
name: Interwar
label: Ére de Entre-deux-guerres @fr
label: Zwischenkriegszeit Periodisierung @de
comment: The Interwar Era encompasses all the objects that link the world wars together.

Cold War Era
type: Era
name: Cold War
label: Ére de la Guerre Froide @fr
label: Kalter Krieg Periodisierung @de
comment: The Cold War era contains objects from that era, including historical beginnings and consequences.

Event (Historical)
type: Class
name: Event
label: Évenement (Historique) @fr
label: Event @de
comment: An event that occurs in space and time.
subclass of: Era (Historical)

hasActor
type: ObjectProperty
comment: An Actor in this event.
domain: Event (Historical)
range: Actor

Actor
type: Class
comment: A person performing a certain role within an event.

Identity
type: ObjectProperty
comment: The identity of the person who committed the act.
domain: Actor
range: Agent

In Role
type: ObjectProperty
comment: The role taken on by this actor.
domain: Actor
range: Role

A natural person
type: Class
label: Une personne naturelle @fr
comment: A real person.
subclass of: Person

Name
type: DatatypeProperty
comment: The name of the person. See namingRuleUsed property for formatting.
domain: A moral person
domain: A natural person
range: string
same property: name
same property: preferredNameForThePerson

Middle Name (First)
type: DatatypeProperty
name: Middle Name
comment: The first middle name of the person, in the order that the name is read.
domain: A natural person
range: string

Middle Name (Second)
type: DatatypeProperty
name: Middle Name
comment: The second middle name of the person, in the order that the name is read.
domain: A natural person
range: string

Middle Name (Third)
type: DatatypeProperty
name: Middle Name
comment: The third middle name of the person, in the order that the name is read.
domain: A natural person
range: string

Middle Name (Fourth)
type: DatatypeProperty
name: Middle Name
comment: The fourth middle name of the person, in the order that the name is read.
domain: A natural person
range: string

Middle Name (Fifth)
type: DatatypeProperty
name: Middle Name
comment: The fifth middle name of the person, in the order that the name is read.
domain: A natural person
range: string

First Name
type: DatatypeProperty
comment: The first name of the person.
domain: A natural person
range: string
same property: firstName
same property: forename
same property: givenName

Last Name
type: DatatypeProperty
comment: The last name of the person.
domain: A natural person
range: string
same property: lastName
same property: surname
same property: familyName

Name Qualifier
type: DatatypeProperty
comment: Used to disambiguate person according to role or era. Use for rdf:label, needs further delegation.
domain: A natural person
domain: A moral person
range: string
same property: locQualifier

honorific Prefix
type: DatatypeProperty
comment: Used primarily for Royal titles.
domain: A natural person
domain: A moral person
range: string
same property: title
same property: honorificPrefix

Honorific Suffix
type: DatatypeProperty
comment: Used primarily for Royal titles.
domain: A natural person
domain: A moral person
range: string
same property: honorificSuffix

Name used rule
type: ObjectProperty
comment: This property describes the rules used to create the contents of the name property. Should have a class definition for this.
domain: A natural person
domain: A moral person
same property: usedRules

BirthDay
type: ObjectProperty
comment: The birthday of a natural person or the foundation date of an organization.
domain: A natural person
domain: A moral person
range: TemporalEntity
range: Era (Historical)
range: Event (Historical)
same property: dateOfEstablishment
same property: birthday
same property: dateOfBirth

Death Day
type: ObjectProperty
comment: The death day of a natural person or the termination date of an organization.
domain: A natural person
domain: A moral person
range: TemporalEntity
range: Era (Historical)
range: Event (Historical)
same property: dateOfTermination
same property: dateOfDeath

Gender
type: ObjectProperty
comment: The gender of person, class or role. Use this for gender hints in roles such as 'Sister'.
domain: A natural person
domain: Role
range: Gender
same property: gender

Gender
type: Class
name: Gender
label: Sexe @fr
label: Geschlechtsangabe @de
comment: Superclass for different coding of Gender types. Extend as necessary.

Gender (Strict)
type: Class
name: Gender
comment: Strict F/M coding of Gender types, with restriction.
subclass of: SimplebGender

Woman
type: SimpleGender
name: F
label: Femme
label: Frau

Man
type: SimpleGender
name: M
label: Homme
label: Mann

Gender (ISO/IEC 5218)
type: Class
name: Gender
comment: Strict F/M coding of Gender types, with restriction.
subclass of: Gender (Strict)

Woman
type: GenderISO5218
name: 2
label: Femme
label: Frau

Man
type: GenderISO5218
name: 1
label: Homme
label: Mann

Gender Unknown
type: GenderISO5218
name: 0
label: Sex Inconnu
label: Mann

Not Available
type: GenderISO5218
name: 9

SimplebGender
type: Class
name: Gender
comment: Simple F/M coding of Gender types.
subclass of: Gender

Woman
type: StrictGender
name: F
label: Femme
label: Frau

Man
type: StrictGender
name: M
label: Homme
label: Mann

Role
type: Class
label: ? @de
comment: A role or function without a specific organizationa context.

Father
type: Role
label: Père @fr
label: Vater @de
comment: A father is defined as a male parent of any type of offspring. The adjective "paternal" refers to father, parallel to "maternal" for mother. The verb "to father" means to procreate or to sire a child from which also derives the gerund "fathering".

Mother
type: Role
label: Mère @fr
label: Mutter @de
comment: A mother, mom, mum, momma or mama, is a woman who has conceived, given birth to, or raised a child in the role of a parent. Because of the complexity and differences of a mother's social, cultural, and religious definitions and roles, it is challenging to define a mother to suit a universally accepted definition. The male equivalent is a father.

Parent
type: Role
label: Parent (famille) @fr
label: Mutterschaft @de
label: Elternschaft @de
comment: A parent is a caretaker of the offspring in their own species. In humans, a parent is the mother or the father figure of a child (where "child" refers to offspring, not necessarily age). Children can have one or more parents, but they must have two biological parents. Biological parents consist of the male who sired the child and the female who gave birth to the child. In all human societies, the biological mother and father are both responsible for raising their young.

Wife
type: Role
comment: A wife is a female partner in a marriage. The rights and obligations of the wife regarding her spouse(s) and others, and her status in the community and in law, varies between cultures and has varied over time.

Husband
type: Role
label: Marié @fr
comment: A husband is a male participant in a marriage. The rights and obligations of the husband regarding his spouse and others, and his status in the community and in law, vary between cultures and has varied over time. Four in five American men get married in their lifetime.

Child
type: Role
label: Enfant @fr
label: Kind @de
comment: Biologically, a child is generally a human between the stages of birth and puberty. Some vernacular definitions of a child include the fetus, as being an unborn child. The legal definition of "child" generally refers to a minor, otherwise known as a person younger than the age of majority.

Son
type: Role
label: Fils (famille) @fr
comment: A son is a male offspring; a boy or man in relation to his parents. The female analogue is a daughter.

Daughter
type: Role
label: Fille (parenté) @fr
comment: A daughter is a female offspring; a girl, woman, or female animal in relation to her parents. The male equivalent is a son. Analogously the name is used on several areas to show relations between groups or elements.

Sibling
type: Role
label: Frères et sœurs @fr
comment: Siblings are people who share at least one parent. A male sibling is called a brother; and a female sibling is called a sister. In most societies throughout the world, siblings usually grow up together and spend a good deal of their childhood socializing with one another. This genetic and physical closeness may be marked by the development of strong emotional bonds such as love or hostility.

Grandparent
type: Role
label: Aïeul @fr
label: Großeltern @de
comment: Grandparents are the parents of a person's own parent, whether that be a father or a mother. Every sexually-reproducing creature who is not a genetic chimera has a maximum of four genetic grandparents, eight genetic great-grandparents, sixteen genetic great-great-grandparents, etc. Rarely, such as in the case of sibling or half-sibling incest, these numbers are lower.

Aunt
type: Role
label: Tante @fr
comment: An aunt or mausi is a person who is the sister or sister-in-law of a parent. A man with an equivalent relationship is an uncle, and the reciprocal relationship is that of a nephew or niece. "Aunt" (or "auntie") may also be an honorific bestowed upon an individual of fictive kinship.

Uncle
type: Role
comment: Uncle is a family relationship or kinship, the brother or brother-in-law of a parent. A woman with an equivalent relationship is an aunt, and the reciprocal relationship is that of a nephew or niece. In some cultures and families, children may refer to the cousins of their parents as "aunt" or "uncle".

Cousin
type: Role
label: Cousin (famille) @fr
comment: In kinship terminology, a cousin is a relative with whom one shares one or more common ancestors. The term is rarely used when referring to a relative in one's immediate family where there is a more specific term to describe the relationship (e.g. , one's parents, siblings and descendants). The term "blood relative" can be used synonymously and establishes the existence of a genetic link.

Nephew
type: Role

Niece
type: Role

Friend
type: Role

Witness
type: Role
label: Témoin @fr
label: Zeuge @de
comment: A witness is someone who has firsthand knowledge about an event, or in the criminal justice systems usually a crime, through his or her senses (e.g. seeing, hearing, smelling, touching) and can help certify important considerations about the crime or event. A witness who has seen the event first hand is known as an eyewitness. Witnesses are often called before a court of law to testify in trials. A subpoena commands a person to appear. It is used to compel the testimony of a witness in a trial.

Leader
type: Role

Clergy
type: Role
name: Clergy
label: Clergé @fr
label: Klerus @de
comment: Clergy is a generic term used to refer to the formal religious leadership within some religions.

Appointment
type: Class
label: Poste @fr
label: Termin @de
subclass of: Role
subclass of: Trade
comment: An appointment to a specific post or function.

Rank
type: Class
label: Grade @fr
label: Rang @de
comment: A rank with a hierarchy.
subclass of: Role
subclass of: Trade

Acting Rank
type: Class
label: Grade Intérimaire @fr
label: Handelnden Rang @de
comment: A temporairy rank with a hierarchy.
subclass of: Rank

Rank Junior To
type: ObjectProperty
name: Junior to
label: Rang Junior A @fr
label: nachrangig zu @de
comment: The rank is junior to another rank within the chain of command.
domain: Rank
range: Rank
inverse of: Rank Senior To

Rank Senior To
type: ObjectProperty
name: Senior to
label: Rang Senior A @fr
label: vorrangig gegenüber @de
comment: The rank is senior to another rank within the chain of command.
domain: Rank
range: Rank

Rank Junior To (Transitive)
type: ObjectProperty
name: Junior to
label: Rang Junior A (Transitif) @fr
label: nachrangig zu (transitiv) @de
comment: The rank is junior to another rank within the chain of command.
sub property of: Rank Junior To
domain: Rank
range: Rank
inverse of: Rank Senior To (Transitive)
type: TransitiveProperty

Rank Senior To (Transitive)
type: ObjectProperty
name: Senior to
label: Rang Senior A (Transitif) @fr
label: vorrangig gegenüber (transitiv) @de
comment: The rank is senior to another rank within the chain of command.
sub property of: Rank Senior To
domain: Rank
range: Rank
type: TransitiveProperty

Trade
type: Class
label: Travail @fr
comment: A job function or specific occupation.
subclass of: Role

Chaplain
type: Trade
name: Chaplain
label: Chapelain @fr
label: Kaplan @de
comment: Traditionally, a Chaplain is a minister in a specialized setting such as a priest, pastor, rabbi, or imam or lay representative of a religion attached to a secular institution such as a hospital, prison, military unit, police department, university, or private chapel.
type: Clergy

Groom (Horse)
type: Trade
name: Groom
label: Groom de Cheval @fr
label: ???? @de
comment: A person who works in a stable taking care of horses.
type: Clergy
different from: dbpedia:Groom

Matron
type: Trade
name: Matron
label: Oberin @de
comment: Matron is the job title of a very senior nurse in several countries, including the United Kingdom, its former colonies, including the Republic of Ireland, although the title Clinical Nurse Manager has become acceptable as an alternative.
subclass of: Nurse (Medical)

Nursing Sister
type: Trade
name: Nursing Sister
subclass of: Nurse (Medical)
subclass of: TradeNun

Sailor
type: Trade
name: Sailor
label: Marin (profession) @fr
label: Segler (Schifffahrt) @de
comment: A sailor, mariner, or seaman is a person who navigates water-borne vessels or assists in their operation, maintenance, or service. The term can apply to professional mariners, military personnel, and recreational sailors as well as a plethora of other uses.

Sister (Nun)
type: Trade
name: Sister
label: Nonne @de
label: Ordensschwester @de
comment: A nun is a woman who has taken vows committing her to live a spiritual life. She may be an ascetic who voluntarily chooses to leave mainstream society and live her life in prayer and contemplation in a monastery or convent. The term "nun" is applicable to Catholics – both eastern and western traditions – Orthodox Christians, Anglicans, Lutherans, Jains, Buddhists, and Taoists.
type: Clergy

Nurse (Medical)
type: Trade
name: Nurse
label: Infirmier @fr
label: Gesundheits- und Krankenpfleger @de
comment: A nurse is a healthcare professional who, in collaboration with other members of a health care team, is responsible for: treatment, safety, and recovery of acutely or chronically ill individuals; health promotion and maintenance within families, communities and populations; and, treatment of life-threatening emergencies in a wide range of health care settings.

A moral person
type: Class
label: Une personne morale @fr
comment: An organization or group of people with a common goal, incorporated or not. In the Muninn context use this class for any organised group and the foaf:Group class for any un-organized group.
subclass of: Organization

Next Incarnation
type: ObjectProperty
domain: A moral person
range: A moral person
sub property of: next instantiation

Previous Incarnation
type: ObjectProperty
domain: A moral person
range: A moral person
sub property of: previous instantiation

has Part
type: ObjectProperty
domain: Agent
range: Agent
domain: A moral person
range: A moral person
same property: hasPart

is Part Of
type: ObjectProperty
domain: Agent
range: Agent
domain: A moral person
range: A moral person
same property: isPartOf
inverse of: has Part

has Attached
type: ObjectProperty
domain: Agent
range: Agent
domain: A moral person
range: A moral person
sub property: hasPart

is Part Of
type: ObjectProperty
domain: Agent
range: Agent
same property: isPartOf
domain: A moral person
range: A moral person
inverse of: has Part

is Lead By
type: ObjectProperty
domain: A moral person
range: Agent
inverse of: Leads

Leads
type: ObjectProperty
range: A moral person
domain: Agent

is Commanded By
type: ObjectProperty
domain: A moral person
range: Agent
inverse of: Leads

Commands
type: ObjectProperty
range: A moral person
domain: Agent

Nominal Headcount
type: DatatypeProperty
comment: The nominal headcount of this organization or class of organization.
range: int
domain: A moral person

A Political Organization
type: Class
label: Une Organisation Politique @fr
comment: An organization that is political in that it forms its own policy.
subclass of: A moral person

Ground Based Organization
type: Class
comment: High level class for people and organizations that live and work on (and under) the ground.

Air Based Organization
type: Class
comment: High level class for people and organizations that live and work in the air.

Water Based Organization
type: Class
comment: High level class for people and organizations that live and work on (and under) water.

Space Based Organization
type: Class
comment: High level class for people and organizations that live and work in outer space.

Colony (Political)
type: Class
label: Colonie ( @fr
comment: A colony of some other organization.
subclass of: A Political Organization
allegiance: A State

A State
type: Class
label: Un État @fr
label: Staat (Begriffsklärung) @de
comment: A state, wheter sovereign or satelite of another.
subclass of: A Political Organization

Subject State
type: Class
label: Un État Depedant @fr
label: Staat (Begriffsklärung) @de
comment: A state within another.
subclass of: A State

Province
type: Class
comment: A province of a state.
subclass of: Subject State

Dominion
type: Class
comment: A dominion of a state..
subclass of: Subject State

Statellite State
type: Class
label: Un État Satellite @fr
comment: A state which is under the sphere of influence of another without being part of it.
subclass of: A State

Sovereign State
type: Class
label: Un État Souverain @fr
comment: A state that is sovereign in all aspects.
subclass of: A State

Monarchy
type: Class
label: Monarchie @fr
subclass of: Sovereign State

Federation
type: Class
label: Fédération @fr
subclass of: Sovereign State

Constitutional State
type: Class
label: État Constitutionelle @fr
subclass of: A State

Constitutional Monarchy
type: Class
label: Monarchie Constitutionelle @fr
subclass of: Monarchy
subclass of: Constitutional State

Semi Presidential Republic
type: Class
subclass of: Republic

Republic
type: Class
subclass of: Sovereign State

Commonwealth (State)
type: Class
label: Commonwealth (État) @fr
comment: Not British Commonwealth
subclass of: A State

Canada (Dominion)
type: Dominion
label: Kanada (Herrschaft) @de
name: Canada
type: Federation
type: Satellite State
birthdate: birth of confederation
deathdate: canada and constitution 1982
next incarnation: Canada (Autonomous Confederation)

birth of confederation
type: Instant
in date time: DateTimeDescription
  year: 1867
  month: --07
  day: ---01

canada and constitution 1982
type: Instant
in date time: DateTimeDescription
  year: 1982
  month: --03
  day: ---29

Canada (Autonomous Confederation)
type: Country
previous incarnation: Canada (Dominion)
label: Canada (Confédération Autonome) @fr
label: Kanada (Bund Autonom) @de
name: Canada
type: Federation
type: Constitutional Monarchy
birthdate: canada and constitution 1982

Newfoundland and Labrador (Dominion)
type: Dominion
label: Terre-Neuve et Labrador (Dominion) @fr
label: Neufundland und Labrador (Herrschaft) @de
name: Dominion of Newfoundland and Labrador
type: Satellite State
birthdate: nwfoundland dominion status
deathdate: nwfoundland joins canada
next incarnation: Newfoundland and Labrador (Province)

nwfoundland dominion status
type: Instant
in date time: DateTimeDescription
  year: 1907
  month: --09
  day: ---26

nwfoundland joins canada
type: Instant
in date time: DateTimeDescription
  year: 1949
  month: --03
  day: ---31

Newfoundland and Labrador (Province)
type: Province
previous incarnation: Newfoundland and Labrador (Dominion)
label: Terre-Neuve et Labrador (Province) @fr
label: Neufundland und Labrador (Provinzen) @de
name: Newfoundland and Labrador
name qualifier: Province of Canada
birthdate: nwfoundland joins canada