The Muninn Naval Ontology
type: Ontology
description: The Muninn Naval Ontology marks up information about maritime establishments.
definition: L'ontologie navale Muninn marque les informations sur les établissements maritimes. @fr
definition: Die Muninn Naval Ontology markiert bis Informationen über maritime Einrichtungen. @de
version info: 0.3
prior version: naval-20140910.owl
date: 20150705
rights: http://creativecommons.org/licenses/by/3.0/
term status: Testing
creator: Warren
publisher: Muninn
preferred namespace prefix: naval
in dataset: datasetdefinition

The Muninn Naval Ontology
type: Dataset
definition: The Muninn Naval Ontology marks up information about maritime establishments.
license: http://creativecommons.org/licenses/by/3.0/
jurisdiction: Canada
attribution URL: http://www.muninn-project.org/
creator: Warren
publisher: Muninn
subject: sh85121591
triples: 1523
entities: 156

Ship
type: Class
label: Navire @fr
label: Schiffen @de
in dataset: datasetdefinition
type: Concept

Hull
type: Class
label: Ship's Hull
label: Coque de Navire @fr
label: Schiffen @de
in dataset: datasetdefinition
type: Concept

Ship Class
type: Class
label: Classe de Navire @fr
label: Schiffsklasse @de
type: Concept
in dataset: datasetdefinition

Ship Class
type: Class
label: Classe de Navire @fr
label: Schiffsklasse @de
sub class of: Ship Class
type: Concept
in dataset: datasetdefinition

Ship Function
type: Class
label: Fonction de Navire @fr
label: ... @de
type: Concept
in dataset: datasetdefinition

Ship Function
type: Class
label: Fonction de Navire @fr
label: ... @de
sub class of: Ship Function
type: Concept
in dataset: datasetdefinition

Ship Type
type: Class
label: Type de Navire @fr
label: ... @de
type: Concept
in dataset: datasetdefinition

Military Ship Type
type: Class
label: Type de Navire Militaire @fr
label: ... @de
type: Concept
in dataset: datasetdefinition

Sail Ship
type: Class
label: Navire à voile @fr
label: Schiffen @de
sub class: Ship
type: Concept
in dataset: datasetdefinition

Sail Ship
type: Class
label: Troop Transport
label: Troop Ship
label: Transport de troupes @fr
label: Truppentransporter @de
sub class: Ship
type: Concept
in dataset: datasetdefinition

Sail Plan
type: Class
label: SailPlan
definition: A sail plan is the configuration of the sails on a sailing ship.
equivalent class: Sail plan
type: Concept
in dataset: datasetdefinition

Sail Rig
type: ObjectProperty
label: Sail rig
definition: The specific configuration of the sails on a sailing ship.
domain: Sail Ship
range: Sail Plan
type: Concept
in dataset: datasetdefinition

Previous Ship
type: ObjectProperty
label: Previous instance of this ship
label: Vorherige Instanz dieses Schiff @de
label: Instance précédente de ce navire @fr
definition: Use this to link Queen Marie 2 to Queen Marie 1, etc...
domain: Ship
range: Ship
type: Concept
in dataset: datasetdefinition

Next Ship
type: ObjectProperty
label: Next instance of this ship
label: Weiter Instanz dieses Schiff @de
label: Instance suivante de ce navire @fr
definition: Use this to link Queen Marie 1 to Queen Marie 2, etc...
domain: Ship
range: Ship
type: Concept
in dataset: datasetdefinition

Of Ship Class
type: ObjectProperty
label: The named or numbered class referring to the design of this ship.
domain: Ship
domain: Hull
range: Ship Class
type: Concept
in dataset: datasetdefinition

hasShipNamePrefix
type: ObjectProperty
label: ....
domain: Ship
range: Ship prefix
type: Concept
in dataset: datasetdefinition

Of Ship Function
type: ObjectProperty
label: The named or numbered class referring to the design of this ship.
domain: Ship
domain: Hull
range: Ship Function
type: Concept
in dataset: datasetdefinition

Owned By
type: ObjectProperty
domain: Ship
domain: Hull
type: Concept
in dataset: datasetdefinition

has Call Sign
type: ObjectProperty
label: Ship Call Sign
label: versenden Rufzeichen @de
label: Indicatif d'appel @fr
domain: Ship
type: Concept
in dataset: datasetdefinition

has Port Of Registry
type: ObjectProperty
label: Port shown on ship's registration document
label: Le port d'enregistrement du bateau @fr
label: Heimathafen des Schiffes @de
domain: Ship
range: Port
type: Concept
in dataset: datasetdefinition

has Home Port
type: ObjectProperty
label: Home port of the ship
label: Port d'attache du navire @fr
label: Heimathafen des Schiffes @de
domain: Ship
range: Port
type: Concept
in dataset: datasetdefinition

Country of Service
type: ObjectProperty
label: Pays de Service @fr
label: Land of Service @de
domain: Ship
range: Country
type: Concept
in dataset: datasetdefinition

Previous Ship
type: ObjectProperty
label: Replaced this class
definition: Use this to link Queen Marie 2 to Queen Marie 1, etc...
domain: Ship Class
range: Ship Class
type: Concept
in dataset: datasetdefinition

Next Ship
type: ObjectProperty
label: Was replaced by this class
definition: Use this to link Queen Marie 1 to Queen Marie 2, etc...
domain: Ship Class
range: Ship Class
type: Concept
in dataset: datasetdefinition

shipUsedBy
type: ObjectProperty
domain: Ship Function
domain: Ship Class
type: Concept
in dataset: datasetdefinition

nomenclatureOf
type: ObjectProperty
label: shipClassOf
domain: Ship Function
domain: Ship Class
type: Concept
in dataset: datasetdefinition

Schooner
type: ShipType
label: Schoner @de
label: Goélette @fr
type: Concept
in dataset: datasetdefinition

has instances built
type: ObjectProperty
label: The ships or hulls that were built patterned on this class.
domain: Ship
domain: Hull
range: Ship Class
type: Concept
in dataset: datasetdefinition

IMO
type: ObjectProperty
label: Hull IMO number
domain: Hull
range: IMO number
sub property: hullNumber
type: Concept
in dataset: datasetdefinition

hullNumber
type: ObjectProperty
label: Hull number
domain: Hull
type: Concept
in dataset: datasetdefinition

ENI
type: ObjectProperty
label: Hull European Number of Identification
domain: Hull
range: ENI number
sub property: hullNumber
type: Concept
in dataset: datasetdefinition

Ship Designation
type: Class
label: Designation de Navire @fr
type: Concept
in dataset: datasetdefinition

Warship
type: Class
label: Navire Militare @fr
label: Kriegsschiff @de
sub class of: Ship
type: Concept
in dataset: datasetdefinition

Submarine
type: Class
label: Sous-marin @fr
label: U-Boot @de
sub class of: Ship
type: Concept
in dataset: datasetdefinition

Hospital Ship
type: Class
label: Navire Hôpital @fr
label: Hospitalschiff @de
definition: A hospital ship is a ship designated for primary function as a floating medical treatment facility or hospital. Most are operated by the military forces (mostly navies) of various countries, as they are intended to be used in or near war zones.
sub class of: Ship
type: Concept
in dataset: datasetdefinition

Hospital ship
wikipedia version: 598073439

NATO reporting name
type: DatatypeProperty
domain: Ship Class
type: Concept
in dataset: datasetdefinition

has Ballast Tank
type: ObjectProperty
label: Has Ballast Tank
label: A une citernes à Ballast @fr
label: L @de
domain: Ship
range: Ballast Tank
type: Concept
in dataset: datasetdefinition

Ballast Tank
type: Class
label: Citernes à Ballast @fr
label: Trimmtank @de
equivalent class: Ballast tank
type: Concept
in dataset: datasetdefinition

Ballast Tank
type: Class
label: Citernes à Ballast @fr
label: Trimmtank @de
sub class: Ballast Tank
equivalent class: Ballast tank
type: Concept
in dataset: datasetdefinition

has Agency of Service
type: ObjectProperty
label: Au service de l'agence @fr
definition: Agency that the ship is serving eg: Coast Guard
domain: Ship
type: Concept
in dataset: datasetdefinition

has Builder
type: ObjectProperty
label: Batie par @fr
definition: The original shipbuilder of the hull or ship.
domain: Ship
domain: Hull
type: Concept
in dataset: datasetdefinition

hasMMSINumber
type: ObjectProperty
domain: Ship
type: Concept
in dataset: datasetdefinition

Has Displacement
type: DatatypeProperty
definition: Displacement of ship, in unspecified condition (Metric Tonnes).
domain: Ship
domain: Hull
type: Concept
in dataset: datasetdefinition

Has Full Load Displacement
type: DatatypeProperty
definition: Displacement of ship, under full load condition.
sub property: Has Displacement
type: Concept
in dataset: datasetdefinition

Height of Ship or Hull
type: DatatypeProperty
definition: Height of ship.
domain: Ship
domain: Hull
domain: Ship Class
type: Concept
in dataset: datasetdefinition

Beam of ship or hull
type: DatatypeProperty
definition: Beam of ship or hull.
domain: Ship
domain: Hull
domain: Ship Class

MaxSpeed
type: DatatypeProperty
definition: Beam of ship or hull.
domain: Ship
domain: Hull
domain: Ship Class
type: Concept
in dataset: datasetdefinition

Lenght of ship or hull
type: DatatypeProperty
definition: Lenght of ship or hull.
domain: Ship
domain: Hull
domain: Ship Class

Draft of ship or hull
type: DatatypeProperty
definition: Draft of ship or hull, in unspecified conditions.
domain: Ship
domain: Hull
domain: Ship Class
type: Concept
in dataset: datasetdefinition

Maximum draft of ship or hull
type: DatatypeProperty
definition: Maximum draft of ship or hull.
domain: Ship
domain: Hull
type: Concept
in dataset: datasetdefinition

The number of crewmen on board.
type: DatatypeProperty
definition: The number of crewmen on board.
domain: Ship
type: Concept
in dataset: datasetdefinition

Capital ship
type: MilitaryShipFunction
definition: The capital ships of a navy are its most important warships; they generally possess the heaviest firepower and armor and are traditionally much larger than other naval vessels. A capital ship is generally a leading or a primary ship in a naval fleet.
label: Großkampfschiff @de
label: 主力艦 @ja
label: 주력함 @ko
label: Navire capital @fr
label: Buque capital @es
type: Concept
in dataset: datasetdefinition

Capital ship
wikipedia version: 521057007

Frigate
type: MilitaryShipFunction
type: Concept
definition: A frigate is any of several types of warship, the term having been used for ships of various sizes and roles over the last few centuries.
in dataset: datasetdefinition

Battleship
type: MilitaryShipFunction
definition: A battleship is a large armored warship with a main battery consisting of heavy caliber guns. Battleships are larger, with better arms and armor, than cruisers and destroyers. As the largest armed ships in a fleet, battleships were used to attain command of the sea and represented the apex of a nation's naval power from about 1875 up until World War II.
label: Slagskip @no
label: Bitevní loď @cs
label: Линкор @ru
label: Slagskepp @sv
label: Schlachtschiff @de
label: Slagschip @nl
label: Nave da battaglia @it
label: Thiết giáp hạm @vi
label: Csatahajó @hu
label: Couraçado @pt
label: Pancernik @pl
label: Taistelulaiva @fi
label: 전함 @ko
label: Cuirassé @fr
label: Cuirassat @ca
label: Acorazado @es
label: 戰艦 @zh
label: 戦艦 @ja
label: Лінкор @uk
sub class: Capital ship
type: Concept
in dataset: datasetdefinition

Battleship
wikipedia version: 519294588

Fast battleship
type: MilitaryShipFunction
definition: A fast battleship was a battleship which emphasized speed without - in concept - undue compromise of either armor or armament. Most of the early WWI-era dreadnought battleships were typically built with low design speeds, so the term "fast battleship" is applied to a design which was considerably faster. The extra speed of a fast battleship was normally required so as to equip the vessel for additional roles besides taking part in the line of battle, such as escorting aircraft carriers.
label: Schnelles Schlachtschiff @de
sub class: Battleship
broader: Battleship
type: Concept
in dataset: datasetdefinition

Fast battleship
wikipedia version: 517014120

Coastal defence ship
type: MilitaryShipFunction
definition: Coastal defence ships (sometimes called coastal battleships or coast defence ships) were warships built for the purpose of coastal defence, mostly during the period from 1860 to 1920. They were small, often cruiser-sized warships that sacrificed speed and range for armour and armament.
label: Pansarskepp @sv
label: Navio de defesa de costa @pt
label: Küstenpanzerschiff @de
label: 海防戦艦 @ja
label: Panserskip @no
sub class: Battleship
broader: Battleship
type: Concept
in dataset: datasetdefinition

Coastal defence ship
wikipedia version: 515709417

Dreadnought
type: MilitaryShipFunction
definition: The dreadnought was the predominant type of battleship in the early 20th-century. The first of the kind, the Royal Navy's Dreadnought, had such an impact when launched in 1906 that similar battleships built after her were referred to as "dreadnoughts", and earlier battleships became known as pre-dreadnoughts. Her design had two revolutionary features: an "all-big-gun" armament scheme and steam turbine propulsion.
label: 无畏舰 @zh
label: Drednot @pl
label: 弩級戦艦 @ja
label: 드레드노트 @ko
label: Дредноут (класс кораблей) @ru
sub class: Battleship
broader: Battleship
type: Concept
in dataset: datasetdefinition

Dreadnought
wikipedia version: 517837707

Pre-dreadnought battleship
type: MilitaryShipFunction
definition: Pre-dreadnought battleship is the general term for all of the types of sea-going battleships built between the mid- to late-1880s and 1905. Pre-dreadnoughts replaced the ironclad warships of the 1870s and 1880s. Built from steel, and protected by hardened steel armour, pre-dreadnought battleships carried a main battery of very heavy guns in barbettes (open or with armored gunhouses) supported by one or more secondary batteries of lighter weapons.
label: Додредноут @ru
label: Einheitslinienschiff @de
label: Thiết giáp hạm tiền-dreadnought @vi
label: 前弩級戦艦 @ja
label: 전노급전함 @ko
label: Przeddrednot @pl
label: 前無畏艦 @zh
label: Predreadnought @cs
sub class: Battleship
broader: Battleship
type: Concept
in dataset: datasetdefinition

Pre-dreadnought battleship
wikipedia version: 518922219

Treaty battleship
type: MilitaryShipFunction
definition: A treaty battleship was a battleship built in the 1920s or 1930s under the terms of one of a number of international treaties governing warship construction. Many of these ships played an active role in the Second World War, but none survived long after it.
label: 条約型戦艦 @ja
label: 条约型战列舰 @zh
sub class: Battleship
broader: Battleship
type: Concept
in dataset: datasetdefinition

Treaty battleship
wikipedia version: 506977180

Ship of the line
type: MilitaryShipFunction
definition: A ship of the line was a type of naval warship constructed from the 17th through the mid-19th century to take part in the naval tactic known as the line of battle, in which two columns of opposing warships would manoeuvre to bring the greatest weight of broadside guns to bear. Since these engagements were almost invariably won by the heaviest ships carrying the most powerful guns, the natural progression was to build sailing vessels that were the largest and most powerful of their time.
label: Линейный корабль (парусный) @ru
label: Linjeskepp @sv
label: 风帆战列舰 @zh
label: Sorhajó @hu
label: Řadová loď @cs
label: Okręt liniowy @pl
label: Navire de ligne @fr
label: Linjalaiva (sodankäynti) @fi
label: Vascello @it
label: Linjeskip (marinefartøy) @no
label: Navili de línia @ca
label: Navío de línea @es
label: Tàu chiến tuyến @vi
label: Linieschip @nl
label: Navio de linha @pt
label: Лінійний корабель (вітрильний) @uk
label: 戦列艦 @ja
label: Linienschiff @de
sub class: Battleship
broader: Battleship
type: Concept
in dataset: datasetdefinition

Ship of the line
wikipedia version: 518922607

Ironclad warship
type: MilitaryShipFunction
definition: An ironclad was a steam-propelled warship in the early part of the second half of the 19th century, protected by iron or steel armor plates. The ironclad was developed as a result of the vulnerability of wooden warships to explosive or incendiary shells. The first ironclad battleship, La Gloire, was launched by the French Navy in November 1859.
label: Panzerschiff @de
label: 装甲艦 @ja
label: 铁甲舰 @zh
label: Pansarklädda fartyg @sv
label: Cuirassé à coque en fer @fr
label: Okręt pancerny @pl
label: Броненосец (тип корабля) @ru
sub class: Battleship
broader: Battleship
type: Concept
in dataset: datasetdefinition

Ironclad warship
wikipedia version: 521796747

Sverige Class
type: MilitaryShipClass
in era: EraGreatWar
definition: The Sverige class coastal defence ships (sometimes incorrectly referred to as coastal battleships) were the largest ships to serve in the Swedish Navy until that point. Their design was completely new and was influenced by the ships of the time. Their armament consisted of four 28.3 cm Bofors guns in two turrets and eight 15.2 cm guns in one double and six single turrets. During the Second World War they were the backbone of the Swedish Navy.
label: Sverige class coastal defence ship
label: Sverigeklass @sv
label: Sverige-luokka @fi
label: Classe Sveridge @fr
has lenght meters: 121.6
has draught meters: 6.2
has beam meters: 18.6
has max speed knots: 23.5
has crew size: 443
type: CoastalDefenceShip
owned by: Swedish Navy
type: Concept
in dataset: datasetdefinition

Sverige class coastal defence ship
wikipedia version: 514290408

Monarch Class
type: MilitaryShipClass
in era: EraGreatWar
definition: The Monarch class was a class of battleships, although resembling coastal defence ships, built by Austria-Hungary at the end of the 19th century. The Monarchs were the first ships of their type to utilize turrets. The class comprised three ships: Monarch, Wien, and Budapest, each armed with two 240 mm (9 in) L/40 guns in two turrets and capable of 15.5 knots (28.7 km/h; 17.8 mph) at full speed.
label: Monarch class battleship
label: Classe Monarch @fr
label: Monarch-osztály @hu
label: Třída Monarch @cs
has lenght meters: 99.22
has draught meters: 6.6
has displacement metric tonnes: 5.878
has beam meters: 17.0
has max speed knots: 15.5
has crew size: 469
type: CoastalDefenceShip
type: PreDreadnought
owned by: Austro-Hungarian Navy
type: Concept
in dataset: datasetdefinition

Monarch class battleship
wikipedia version: 514756041

Herluf Trolle Class
type: MilitaryShipClass
in era: EraGreatWar
definition: The Herluf Trolle class was a class of coastal defence ships of the Royal Danish Navy. The class comprised Herluf Trolle, Olfert Fischer and Peder Skram.
label: Herluf Trolle class coastal defense ship
label: Herluf Trolle (1899) @de
has displacement metric tonnes: 3494
has lenght meters: 82.87
has draught meters: 4.93
has beam meters: 15.06
has max speed knots: 15,5
has crew size: 254
type: CoastalDefenceShip
owned by: Royal Danish Navy
type: Concept
in dataset: datasetdefinition

Herluf Trolle class coastal defense ship
wikipedia version: 484156178

Siegfried Class
type: MilitaryShipClass
in era: EraGreatWar
definition: The Siegfried class was a group of six coastal defense ships built by the German Kaiserliche Marine ("Imperial Navy") in the late 19th century. The ships were intended to protect the German coastline from naval attacks. The class comprised the lead ship Siegfried, along with her sisters Beowulf, Frithjof, Heimdall, Hildebrand, and Hagen. All six ships were named after Norse mythological figures.
label: Siegfried class coastal defense ship
label: Classe Siegfried @fr
label: Siegfried-Klasse @de
label: Siegfriedklasse @nl
has lenght meters: 76.4
has draught meters: 5.7
has displacement metric tonnes: 3500
has beam meters: 14.9
has max speed knots: 14
has crew size: 276
type: CoastalDefenceShip
owned by: Kaiserliche Marine
type: Concept
in dataset: datasetdefinition

Siegfried class coastal defense ship
wikipedia version: 516900448

Odin Class
type: MilitaryShipClass
in era: EraGreatWar
definition: The Odin class was a pair of coastal defense ships built for the German Kaiserliche Marine in the late 19th century. The class comprised two ships: Odin, named after the Norse god Odin, and Ägir, named after the Norse god of the same name. The ships were very similar to the preceding Siegfried-class coast defense ships, and are sometimes considered to be one class of ships. Like the preceding Siegfried class ships, Odin and Ägir were obsolete by the time World War I had started.
label: Odin class coastal defense ship
label: Classe Odin @fr
has lenght meters: 79.0
has draught meters: 5.61
has displacement metric tonnes: 3550
has beam meters: 15.2
has max speed knots: 15
type: CoastalDefenceShip
owned by: Kaiserliche Marine
type: Concept
in dataset: datasetdefinition

Odin class coastal defense ship
wikipedia version: 516900564

Evertsen Class
type: MilitaryShipClass
in era: EraGreatWar
definition: The Evertsen class was a class of coastal defense ships of the Royal Netherlands Navy. The class comprised Evertsen, Piet Hein and Kortenaer.
label: Evertsen class coastal defence ship
has lenght meters: 86.2
has draught meters: 5.23
has beam meters: 14.33
has max speed knots: 16
has crew size: 263
has displacement metric tonnes: 3464
type: CoastalDefenceShip
owned by: Royal Netherlands Navy
preceeded by: Evertsen class coastal defence ship
type: Concept
in dataset: datasetdefinition

Evertsen class coastal defence ship
wikipedia version: 511584767

Koningin Regentes Class
type: MilitaryShipClass
in era: EraGreatWar
definition: The Koningin Regentes class was a class of coastal defence ships of the Royal Netherlands Navy. The class comprised Koningin Regentes, De Ruyter and Hertog Hendrik.
label: Koningin Regentes class coastal defense ship
has lenght meters: 96.622
has draught meters: 5.817
has beam meters: 15.189
has max speed knots: 16.5
has displacement metric tonnes: 5002
has crew size: 340
type: CoastalDefenceShip
owned by: Royal Netherlands Navy
succeeded by: HNLMS Marten Harpertzoon Tromp (1904)
preceeded by: Evertsen class coastal defence ship
type: Concept
in dataset: datasetdefinition

Koningin Regentes class coastal defense ship
wikipedia version: 510268196

Tordenskjold Class
type: MilitaryShipClass
in era: EraGreatWar
definition: The Tordenskjold class of coastal defence ships was ordered by Norway as part as the general rearmament in the time leading up to the events in 1905 - when Norway broke out of the union with Sweden - the two ships in the class remained the backbone (alongside the slightly newer Eidsvold class) of the Royal Norwegian Navy until they were considered 'unfit for war' in the mid 1930s.
label: Tordenskjold class coastal defence ship
label: Tordenskjold-klassen @no
label: Броненосцы типа «Харальд Хорфагре» @ru
has lenght meters: 92.66
has draught meters: 5.38
has displacement metric tonnes: 3858
has beam meters: 14.78
has max speed knots: 16.9
has crew size: 245
type: CoastalDefenceShip
owned by: Royal Norwegian Navy
preceeded by: Tordenskjold class coastal defence ship
type: Concept
in dataset: datasetdefinition

Tordenskjold class coastal defence ship
wikipedia version: 501115874

Eidsvold Class
type: MilitaryShipClass
in era: EraGreatWar
definition: The Eidsvold class was a class of coastal defence ships, two of which were built for the Royal Norwegian Navy in 1899 by Armstrong Whitworth. The class consisted of two ships, the HNoMS Eidsvold and HNoMS Norge. Locally they were referred to as panserskip .
label: Eidsvold class coastal defence ship
label: Eidsvold-luokka @fi
label: Eidsvoldklassen @no
label: Броненосцы типа «Норге» @ru
has lenght meters: 94.6
has draught meters: 5.4
has beam meters: 15.7
has crew size: 270
has displacement metric tonnes: 4233
type: CoastalDefenceShip
succeeded by: Bjørgvin class coastal defence ship
preceeded by: Tordenskjold class coastal defence ship
type: Concept
in dataset: datasetdefinition

Eidsvold class coastal defence ship
wikipedia version: 515686986

Bjørgvin Class
type: MilitaryShipClass
in era: EraGreatWar
definition: The Bjørgvin class coastal battleships were ordered by Norway in 1912 to supplement the older Eidsvold and Tordenskjold-class coastal defence ships. The two ships laid down were compulsorily purchased by the Royal Navy when World War I broke out, and classified as monitors. The British government paid Norway £370,000 as compensation for each ship.
label: Bjørgvin class coastal defence ship
label: Bjørgvin-luokka @fi
label: Bjørgvin-Klasse @de
has lenght meters: 94.0
has draught meters: 5.4
has beam meters: 16.8
has max speed knots: 15
has displacement metric tonnes: 4979
has crew size: 305
type: CoastalDefenceShip
owned by: Royal Navy
succeeded by: Bjørgvin class coastal defence ship
type: Concept
in dataset: datasetdefinition

Bjørgvin class coastal defence ship
wikipedia version: 511843164

Admiral Ushakov Class
type: MilitaryShipClass
in era: EraGreatWar
definition: The Admiral Ushakov-class were coast defense battleships built for the Imperial Russian Navy during the 1890s to counter armored ships of the Swedish Navy. All three ships were stationed in the Baltic Sea when the Russo-Japanese war began and sailed with the Baltic Fleet around the Cape of Good Hope to the Pacific. Two ships were captured by the Japanese and one was scuttled during the Battle of Tsushima.
label: Admiral Ushakov class coast defense ship
has lenght meters: 87.3
has draught meters: 5.9
has beam meters: 15.85
has max speed knots: 16
has crew size: 404
has displacement metric tonnes: 5051
type: CoastalDefenceShip
owned by: Russian Navy
owned by: Imperial Japanese Navy
type: Concept
in dataset: datasetdefinition

Svea Class
type: MilitaryShipClass
in era: EraGreatWar
definition: The Svea class was a class of coastal defence ships of the Swedish Navy. The class comprised Svea, Göta and Thule.
label: Svea class coastal defence ship
label: Sveaklass @sv
label: Svea-luokka @fi
has lenght meters: 75.7
has draught meters: 5.18
has max speed knots: 16
has displacement metric tonnes: 2902.9
has crew size: 252
type: CoastalDefenceShip
owned by: Swedish Navy
succeeded by: Oden class coastal defence ship
preceeded by: Svea class coastal defence ship
type: Concept
in dataset: datasetdefinition

Svea class coastal defence ship
wikipedia version: 499803945

Oden Class
type: MilitaryShipClass
in era: EraGreatWar
definition: The Oden class was a class of coastal defence ships of the Swedish Navy. The class comprised Oden, Niord and Thor.
label: Oden class coastal defence ship
label: Odenklass @sv
label: Oden-luokka @fi
has lenght meters: 84.8
has draught meters: 5.28
has beam meters: 14.78
has max speed knots: 16.5
has displacement metric tonnes: 3125.25
has crew size: 252
type: CoastalDefenceShip
succeeded by: Oden class coastal defence ship
preceeded by: Svea class coastal defence ship
type: Concept
in dataset: datasetdefinition

Oden class coastal defence ship
wikipedia version: 499932485

ÄRan Class
type: MilitaryShipClass
in era: EraGreatWar
definition: The Äran class was a class of coastal defence ships of the Swedish Navy. The class comprised Äran, Wasa, Tapperheten and Manligheten.
label: Äran class coastal defence ship
label: Äranklass @sv
label: Äran-luokka @fi
has lenght meters: 87.48
has draught meters: 5
has beam meters: 15.0
has max speed knots: 17
has crew size: 285
has displacement metric tonnes: 3258.60
type: CoastalDefenceShip
type: Concept
in dataset: datasetdefinition

Äran class coastal defence ship
wikipedia version: 499220549

Amiral Baudin Class
type: MilitaryShipClass
definition: The Amiral Baudin class was a type of ironclad battleships of the French Navy.
label: Amiral Baudin class ironclad
label: Classe Amiral Baudin @fr
has lenght meters: 98.0
has max speed knots: 16
has draught meters: 20.7
has displacement metric tonnes: 12150
has beam meters: 21.2
has crew size: 650
type: IroncladWarship
owned by: French Navy
succeeded by: Marceau class ironclad
preceeded by: Amiral Baudin class ironclad
preceeded by: Terrible class battleship
type: Concept
in dataset: datasetdefinition

Amiral Baudin class ironclad
wikipedia version: 514259980

Audacious Class
type: MilitaryShipClass
definition: The Audacious class battleships were designed by Sir Edward Reed at the request of the Board of Admiralty to serve as second-class battleships on distant foreign stations.
label: Audacious class ironclad
label: Audacious-luokka (taistelulaiva) @fi
has lenght meters: 85.344
has draught meters: 6.8
has displacement metric tonnes: 6106
has beam meters: 16.4592
has max speed KPH: 25.002
has crew size: 450
type: IroncladWarship
type: Concept
in dataset: datasetdefinition

Audacious class ironclad
wikipedia version: 507049141

Belleisle Class
type: MilitaryShipClass
definition: The two ships of the Belleisle class, HMS Belleisle and HMS Orion, originally built in Britain for the Turkish Navy, were taken over by the Royal Navy in 1878. In 1878 Russia and Turkey were at war, and it was perceived by the British Government that Britain might be drawn into the conflict. This perception has become known to posterity as "the Russian war scare of 1878".
label: Belleisle class ironclad
label: Clase Belleisle @es
has lenght meters: 74.676
has draught meters: 6.4
has displacement metric tonnes: 4418
has beam meters: 15.8496
has max speed KPH: 22.4092
has crew size: 249
type: IroncladWarship
type: Concept
in dataset: datasetdefinition

Belleisle class ironclad
wikipedia version: 514544116

Colbert Class
type: MilitaryShipClass
definition: The Colbert class was a class of ironclad frigates of the
label: Colbert class ironclad
label: Classe Colbert @fr
has lenght meters: 99.1
has draught meters: 8.1
has displacement metric tonnes: 8600
has beam meters: 17.6
type: IroncladWarship
owned by: French Navy
type: Concept
in dataset: datasetdefinition

Colbert class ironclad
wikipedia version: 496390873

Defence Class
type: MilitaryShipClass
definition: The Defence class of ironclad battleships were the class which historically immediately followed the first two British ironclads, HMS Warrior and HMS Black Prince. The class consisted of two ships, HMS Defence and HMS Resistance.
label: Defence class ironclad
has lenght meters: 92.0496
has draught meters: 7.9
has displacement metric tonnes: 5579
has beam meters: 16.4592
has max speed KPH: 19.909
has crew size: 460
type: IroncladWarship
succeeded by: Hector class ironclad
preceeded by: Warrior class ironclad
type: Concept
in dataset: datasetdefinition

Defence class ironclad
wikipedia version: 496393949

Hector Class
type: MilitaryShipClass
definition: The Hector class battleships, HMS Hector and HMS Valiant, laid down in 1861, were the class which immediately followed the Defence class into service with the Royal Navy. These two ships were classified at the time of their building as armoured frigates, and were essentially a repeat of the Defence class with somewhat greater speed, armament and armour protection.
label: Hector class ironclad
has lenght meters: 85.344
has draught meters: 20.7
has beam meters: 17.0688
has displacement metric tonnes: 6818
has max speed KPH: 22.224
type: IroncladWarship
owned by: Royal Navy
succeeded by: Hector class ironclad
in era: EraVictorian
in era: EraEdwardian
in era: EraGreatWar
type: Concept
in dataset: datasetdefinition

Hector class ironclad
wikipedia version: 499998593

Hydra Class
type: MilitaryShipClass
definition: The Hydra class of ironclads composed three ships, Hydra, Spetsai, and Psara. The ships were ordered from France in 1885 during the premiership of Charilaos Trikoupis, as part of a wider reorganization and modernization of the Greek armed forces, which had proved themselves inadequate during the Cretan uprising of 1866. Launched in 1889 and 1890, the ships were ready for service with the Greek Navy by 1892.
label: Hydra class ironclad
has lenght meters: 101.803
has displacement metric tonnes: 4808
has draught meters: 5.5
has beam meters: 15.8
has max speed KPH: 31.484
type: IroncladWarship
owned by: GreekNavy
type: Concept
in dataset: datasetdefinition

Hydra class ironclad
wikipedia version: 517068833

Lord Clyde Class
type: MilitaryShipClass
definition: The Lord Clyde class battleships, which consisted of HMS Lord Clyde and HMS Lord Warden, were wooden-hulled ironclad frigates, designed by Sir Edward Reed, and promoted by the Board of Admiralty for economic reasons, in order to make use of the large stocks of seasoned timber available in the shipyards.
label: Lord Clyde class ironclad
has lenght meters: 85.344
has displacement metric tonnes: 7968
has beam meters: 17.9832
has max speed KPH: 24.076
has crew size: 605
type: IroncladWarship
owned by: Royal Navy
type: Concept
in dataset: datasetdefinition

Lord Clyde class ironclad
wikipedia version: 496940406

Magenta Class
type: MilitaryShipClass
definition: The Magenta class was a class of broadside ironclads of the French Navy. The type was designed by Dupuy de Lôme. The ships carried 50 guns in broadside. They were the only ironclad two-deckers ever built, and the first ironclad to feature a naval ram
label: Magenta class ironclad
label: Classe Magenta @fr
has lenght meters: 95.0
has displacement metric tonnes: 7129
has beam meters: 17.7
has max speed knots: 12
has crew size: 681
type: IroncladWarship
owned by: French Navy
type: Concept
in dataset: datasetdefinition

Magenta class ironclad
wikipedia version: 496936345

Marceau Class
type: MilitaryShipClass
definition: The Marceau class was class of ironclad battleships of the French Navy. They were the last barbette ships built in France. Marceau Builder: La Seyne-sur-Mer Ordered: 27 December 1880 Launched: 24 May 1887 Fate: Broken up in 1922 Magenta Builder: Toulon Ordered: 7 October 1880 Launched:19 April 1890 Fate: Broken up in 1911 Neptune Builder: Brest Ordered: 7 October 1880 Launched: 7 May 1887 Fate: Sunk as target ship in 1913
label: Marceau class ironclad
label: Classe Marceau @fr
has lenght meters: 99.0
has draught meters: 8.4
has displacement metric tonnes: 10558
has max speed knots: 16
has beam meters: 20.0
has crew size: 651
type: IroncladWarship
succeeded by: French battleship Brennus
succeeded by: Charles Martel class battleship
succeeded by: Marceau class ironclad
preceeded by: Amiral Baudin class ironclad
preceeded by: Marceau class ironclad
type: Concept
in dataset: datasetdefinition

Marceau class ironclad
wikipedia version: 514296633

Preussen Class
type: MilitaryShipClass
definition: The Preussen class of armored frigates was a class of three ships built for the German Imperial Navy in the early 1870s. The lead ship, Preussen, was laid down in 1871 and launched in 1873. Friedrich der Grosse also was laid down in 1871 and launched in 1874. Grosser Kurfürst, although the first to be laid down, in 1869, was the last to be completed, launched in 1875. The ships served in the fleet starting in 1876, when Preussen was commissioned.
label: Preussen class ironclad
label: Classe Preussen @fr
label: Clase Preußen @es
has lenght meters: 96.59
has draught meters: 7.11
has displacement metric tonnes: 6821
has beam meters: 16.3
has max speed KPH: 25.928
has crew size: 454
type: IroncladWarship
owned by: Kaiserliche Marine
type: Concept
in dataset: datasetdefinition

Preussen class ironclad
wikipedia version: 516167825

Prince Consort Class
type: MilitaryShipClass
definition: The Prince Consort class of battleship were four Royal Navy wooden-hulled broadside ironclads: HMS Royal Oak, HMS Prince Consort, HMS Ocean, and HMS Caledonia. They were originally laid down as Bulwark-class battleships, but were converted to ironclads. Royal Oak was Britain's fifth ironclad battleship completed. Prince Consort, Ocean, and Caledonia were built to a common design and are today known as the Prince Consort class, though contemporaries knew them as the Caledonia class.
label: Prince Consort class ironclad
has lenght meters: 83.2104
has draught meters: 8.4
has displacement metric tonnes: 6942
has beam meters: 17.6784
has max speed KPH: 22.224
has crew size: 605
type: IroncladWarship
type: Concept
in dataset: datasetdefinition

Prince Consort class ironclad
wikipedia version: 507049485

Scorpion Class
type: MilitaryShipClass
definition: The two Scorpion class ironclads, HMS Scorpion and HMS Wivern, were ordered by the Confederate States Navy in 1862 and seized in 1863 by the British to prevent their delivery. This would have violated the Foreign Enlistment Act, which forbade British subjects to build or arm any ships for governments at war with governments friendly to Great Britain. The Scorpion-class were masted turret ships, each with two gun turrets that were designed to mount a pair of heavy muzzle-loading guns.
label: Scorpion class ironclad
has lenght meters: 68.2752
has draught meters: 5.2
has beam meters: 12.8016
has max speed KPH: 19.446
has crew size: 153
has displacement metric tonnes: 2795
type: IroncladWarship
owned by: Royal Navy
type: Concept
in dataset: datasetdefinition

Scorpion class ironclad
wikipedia version: 447843970

Swiftsure Class
type: MilitaryShipClass
definition: The Swiftsure class battleships of the late Victorian era were broadside ironclads designed and built specifically for service as Flagships on the Pacific station. In appearance the two ships of the class, HMS Swiftsure and HMS Triumph, were very similar to HMS Audacious; under water their hulls were very similar to that of HMS Defence. The intention was to make the ships good performers under sail, while at the same time being stable ships and good gun platforms.
label: Swiftsure class ironclad
label: Swiftsure-luokka (taistelulaiva, 1870) @fi
has lenght meters: 85.344
has draught meters: 7.44
has beam meters: 16.764
has max speed KPH: 25.928
has displacement metric tonnes: 7020
has crew size: 450
type: IroncladWarship
owned by: Royal Navy
type: Concept
in dataset: datasetdefinition

Swiftsure class ironclad
wikipedia version: 514639517

Warrior Class
type: MilitaryShipClass
definition: The Warrior class ironclads were a class of two warships built for the Royal Navy between 1859 and 1862, the first ocean-going ironclads with iron hulls ever constructed. The ships were designed as armoured frigates in response to an invasion scare sparked by the launch of the French ironclad Gloire and her three sisters in 1858.
label: Warrior class ironclad
label: Warriorklasse @nl
has lenght meters: 128.016
has draught meters: 8.2
has beam meters: 17.6784
has max speed KPH: 25.928
has crew size: 707
has displacement metric tonnes: 9284
type: IroncladWarship
owned by: Royal Navy
preceeded by: Warrior class ironclad
type: Concept
in dataset: datasetdefinition

Warrior class ironclad
wikipedia version: 479918481

Kaiser Class
type: MilitaryShipClass
definition: The Kaiser class of ironclad warships was a pair of vessels built for the German Imperial Navy in the early 1870s. The lead ship, Kaiser, was laid down in 1871 and launched in 1874. Deutschland was laid down in 1872 and launched in 1874; both ships were built by the Samuda Brothers shipyard in London. They were the last German capital ships built by a foreign shipyard.
label: Kaiser class ironclad
label: Classe Kaiser (1875) @fr
label: Clase Kaiser (1875) @es
has lenght meters: 89.34
has draught meters: 24.2
has displacement metric tonnes: 7645
has beam meters: 19.1
has max speed KPH: 27.0392
has crew size: 600
type: IroncladWarship
owned by: Kaiserliche Marine
type: Concept
in dataset: datasetdefinition

Kaiser class ironclad
wikipedia version: 517319626

Rhein Class
type: MilitaryShipClass
definition: The Rhein class of ironclad monitors were a pair of ships built by the German Imperial Navy in the aftermath of the Franco-Prussian War. The class comprised two ships, Rhein and Moselle; both were built by the AG Weser shipyard in Bremen, in 1872–1874. They were armed with a pair of 12 cm (4.7 in) bronze cannon in a revolving gun turret. The ships were intended to protect the German coast in the event of a war with France, but had short service lives, as war did not come.
label: Rhein class monitor
has draught meters: 1.6
has displacement metric tonnes: 283.0
has lenght meters: 49.6
has beam meters: 7.85
has max speed knots: 6.5
has crew size: 28
type: Monitor
type: Concept
in dataset: datasetdefinition

Rhein class monitor
wikipedia version: 496397167

Sachsen Class
type: MilitaryShipClass
definition: The Sachsen class of armored frigates was a class of four ships built by the German Imperial Navy in the late 1870s to early 1880s. The ships—Sachsen, Bayern, Württemberg, and Baden—were designed to operate as part of an integrated coastal defense network. The ships were intended to sortie from fortified bases to break up an enemy blockade or landing attempt. Armed with six 26 cm (10 in) guns, they were also intended to fight hostile ironclads on relatively equal terms.
label: Sachsen class ironclad
label: Classe Sachsen @fr
label: Sachsen-Klasse (1877) @de
has lenght meters: 98.2
has draught meters: 6.32
has beam meters: 18.4
has max speed KPH: 24.076
has displacement metric tonnes: 7635
has crew size: 317
type: IroncladWarship
owned by: Kaiserliche Marine
type: Concept
in dataset: datasetdefinition

Sachsen class ironclad
wikipedia version: 516258802

Nelson Class
type: MilitaryShipClass
definition: The Nelson class was a class of two battleships of the British Royal Navy, built shortly after, and under the terms of, the Washington Naval Treaty of 1922. They were the only British battleships built between the Revenge class (ordered in 1913) and the King George V class, ordered in 1936. The ships were named after famous British admirals: George Brydges Rodney, 1st Baron Rodney of the Battle of Cape St. Vincent and Horatio Nelson, 1st Viscount Nelson of the Battles of the Nile and Trafalgar.
label: Nelson class battleship
label: Nelson-luokka (taistelulaiva) @fi
label: Classe Nelson (cuirassé) @fr
label: Nelson-Klasse (1925) @de
label: Classe Nelson (nave da battaglia 1925) @it
label: Линейные корабли типа «Нельсон» @ru
label: Třída Nelson @cs
label: Nelson (lớp thiết giáp hạm) @vi
has lenght meters: 201.168
has draught meters: 8.7
has displacement metric tonnes: 30799
has beam meters: 32.3088
has max speed KPH: 42.596
has crew size: 1361
type: TreatyBattleship
owned by: Royal Navy
succeeded by: King George V class battleship (1939)
preceeded by: Nelson class battleship
type: Concept
in dataset: datasetdefinition

Nelson class battleship
wikipedia version: 522717041

Littorio Class
type: MilitaryShipClass
definition: The Littorio class, also known as the Vittorio Veneto class, was a class of battleship of the Regia Marina, the Italian navy. The class was composed of four ships: Littorio, Vittorio Veneto, Roma, and Impero. Only the first three ships of the class were completed, however. Built between 1934 and 1942, they were the most modern battleships used by Italy during World War II.
label: Littorio class battleship
label: Littorio-Klasse @de
label: Classe Littorio @it
label: Littorio-klassen @no
label: Pancerniki typu Littorio @pl
label: Линейные корабли типа «Литторио» @ru
label: Clase Littorio @es
has lenght meters: 237.76
has draught meters: 9.6
has displacement metric tonnes: Standard:
has beam meters: 32.82
has max speed KPH: 55.56
type: TreatyBattleship
owned by: Regia Marina
succeeded by: Caracciolo class battleship
type: Concept
in dataset: datasetdefinition

Littorio class battleship
wikipedia version: 522271616

Richelieu Class
type: MilitaryShipClass
definition: The Richelieu class battleships were the last and largest battleships of the French Navy, staying in service into the 1960s. They still remain to this day the largest warships ever built by France.
label: Richelieu class battleship
label: Richelieu-luokka @fi
label: Classe Richelieu @fr
label: Richelieu-Klasse @de
label: Richelieu osztály @hu
label: Линейные корабли типа «Ришелье» @ru
label: Třída Richelieu @cs
label: Richelieu (lớp thiết giáp hạm) @vi
has lenght meters: 247.85
has draught meters: 9.63
has displacement metric tonnes: 31751
has beam meters: 33.0
has max speed KPH: 55.56
has crew size: 1280
type: TreatyBattleship
preceeded by: Dunkerque class battleship
succeeded by: Alsace class battleship
owned by: French Navy
type: Concept
in dataset: datasetdefinition

Richelieu class battleship
wikipedia version: 513557432

King George V Class
type: MilitaryShipClass
definition: The King George V-class battleships were the most modern British battleships used during World War II. Five ships of this class were commissioned: King George V (1940), Prince of Wales (1941), Duke of York (1941), Howe (1942) and Anson (1942). The Washington Naval Treaty of 1922 limited all of the number, displacement, and armaments of warships built following its ratification, and this was extended by the First London Naval Treaty but these treaties were due to expire in 1936.
label: King George V class battleship (1939)
label: King George V -luokka (1939) @fi
label: Classe King George V (1939) @fr
label: King-George-V-Klasse (1939) @de
label: V. György király osztály (1939) @hu
label: Classe King George V (nave da battaglia 1939) @it
label: King George V-klasse (1939) @nl
label: Pancerniki typu King George V (1940) @pl
label: Линейные корабли типа «Кинг Джордж V» (1939) @ru
label: Třída King George V (1939) @cs
label: Clase King George V (1939) @es
label: King George V (lớp thiết giáp hạm) (1939) @vi
has lenght meters: 227.076
has draught meters: 9.9
has displacement metric tonnes: 34501
has beam meters: 31.3944
has crew size: 1314
type: TreatyBattleship
type: FastBattleship
preceeded by: NelsonClass
owned by: Royal Navy
succeeded by: Lion class battleship
type: Concept
in dataset: datasetdefinition

King George V class battleship (1939)
wikipedia version: 521843003

Iowa Class
type: MilitaryShipClass
definition: The Iowa-class battleships were a class of fast battleships ordered by the United States Navy in 1939 and 1940 to escort the Fast Carrier Task Forces which would operate in the Pacific Theater of World War II. Six were ordered during the course of World War II, but only four were completed in time to see service in the Pacific Theater. The last two had been laid down, but as a result of the postwar draw down of the armed forces they were canceled prior to completion and eventually scrapped.
label: Iowa class battleship
label: Iowa-klass @sv
label: Iowa-luokka @fi
label: Classe Iowa @fr
label: Iowa-Klasse @de
label: Iowa osztály @hu
label: Iowa-klasse @nl
label: Iowa-klassen @no
label: Pancerniki typu Iowa @pl
label: Линейные корабли типа «Айова» @ru
label: Třída Iowa @cs
label: Clase Iowa @es
has lenght meters: 271.272
has draught meters: 10.9728
has displacement metric tonnes: 47173
has beam meters: 32.9184
has max speed KPH: 57.412
has crew size: 2700
type: TreatyBattleship
owned by: United States Navy
succeeded by: Montana class battleship
preceeded by: SouthDakotaClass
type: Concept
in dataset: datasetdefinition

Iowa class battleship
wikipedia version: 522752035

South Dakota Class
type: MilitaryShipClass
definition: The South Dakota-class was a group of four fast battleships built by the United States Navy. They were the second class of battleships to be named after the 40th State; the first class was designed in the 1920s and canceled under the terms of the Washington Naval Treaty. The class comprised four ships: South Dakota, Indiana, Massachusetts, and Alabama.
label: South Dakota class battleship (1939)
label: South-Dakota-Klasse (1942) @de
label: Classe South Dakota (nave da battaglia 1939) @it
label: Pancerniki typu South Dakota (1939) @pl
label: Classe South Dakota @pt
label: Линейные корабли типа «Саут Дакота» @ru
label: Třída South Dakota (1939) @cs
label: Clase South Dakota (1942) @es
label: South Dakota (lớp thiết giáp hạm) (1939) @vi
has lenght meters: 207.264
has displacement metric tonnes: 31751
has beam meters: 32.9794
has max speed KPH: 50.004
type: TreatyBattleship
owned by: United States Navy
succeeded by: IowaClass
preceeded by: NorthCarolinaClass
type: Concept
in dataset: datasetdefinition

South Dakota class battleship (1939)
wikipedia version: 518333982

North Carolina Class
type: MilitaryShipClass
definition: The North Carolina class was a group of two fast battleships, North Carolina and Washington, built for the United States Navy in the late 1930s and early 1940s. The navy was originally uncertain whether the ships should be fast enough to counter the Japanese Kongō class, which was believed by the United States to be capable of 26 knots (30 mph; 48 km/h), or should sacrifice speed for additional firepower and armor.
label: North Carolina class battleship
label: Classe North Carolina @fr
label: North-Carolina-Klasse @de
label: Линейные корабли типа «Норт Кэролайн» @ru
label: Třída North Carolina @cs
label: North Carolina (lớp thiết giáp hạm) @vi
has lenght meters: 221.894
has draught meters: 10.3632
has displacement metric tonnes: 37200
has beam meters: 33
has max speed KPH: 51.856
type: TreatyBattleship
owned by: United States Navy
succeeded by: North Carolina class battleship
preceeded by: South Dakota class battleship (1920)
type: Concept
in dataset: datasetdefinition

North Carolina class battleship
wikipedia version: 515483219

Dunkerque Class
type: MilitaryShipClass
definition: The Dunkerque class battleship was a type of warship constructed for the French Navy in the 1930s. The Dunkerques were designed to counter the German Deutschland class pocket battleships. Their main armament were two quadruple 330 mm turrets forward, with a 225 mm (8.9 in) thick armoured belt. They were smaller, with 26,500-27,300 ton-standard displacement and with a smaller main artillery caliber than the battleships authorized by the Washington Naval Treaty.
label: Dunkerque class battleship
label: Dunkerque-luokka @fi
label: Classe Dunkerque @fr
label: Classe Dunkerque (incrociatore da battaglia) @it
label: Pancerniki typu Dunkerque @pl
label: Линейные корабли типа «Дюнкерк» @ru
label: Třída Dunkerque @cs
label: Dunkerque (lớp thiết giáp hạm) @vi
has lenght meters: 215.1
has draught meters: 8.7
has displacement metric tonnes: 26500
has beam meters: 31.1
has max speed KPH: 57.5231
has crew size: 1381
type: FastBattleship
preceeded by: Bretagne class battleship
succeeded by: RichelieuClass
owned by: French Navy
owned by: Vichy French Navy
in era: EraSecondWorldWar
type: Concept
in dataset: datasetdefinition

Dunkerque class battleship
wikipedia version: 520597110

Lion Class
type: MilitaryShipClass
definition: The Lion class battleships were a class of six fast battleships designed for the Royal Navy in the late 1930s. They were a larger, improved version of the King George V class with 16-inch (406 mm) guns. Only two ships were laid down before World War II began in September 1939 and a third was ordered during the war, but their construction was suspended shortly afterwards.
label: Lion class battleship
label: Lion-luokka (taistelulaiva) @fi
label: Classe Lion (cuirassé) @fr
label: Lion-Klasse (1939) @de
label: Pancerniki typu Lion @pl
label: Линейные корабли типа «Лайон» @ru
label: Clase Lion @es
label: Lion (lớp thiết giáp hạm) @vi
has displacement metric tonnes: 38600
has lenght meters: 241.706
has draught meters: 10
has beam meters: 32.9184
has max speed KPH: 52.319
has crew size: 1750
type: FastBattleship
owned by: Royal Navy
preceeded by: KingGeorgeVClass
type: Concept
in dataset: datasetdefinition

Lion class battleship
wikipedia version: 518921843

British E-class submarine
type: MilitaryShipClass
label: Classe E (sous-marin) @fr
label: E級潛艇 (英國) @zh
label: Подводные лодки типа E @ru
label: Brytyjskie okręty podwodne typu E @pl
label: E級潜水艦 (イギリス海軍) @ja
definition: The British E class submarines started out as improved versions of the British D class submarine.
has draught meters: 3.81
owned by: Royal Navy
owned by: Royal Australian Navy

British E-class submarine
wikipedia version: 632667731